Are you the publisher? Claim or contact us about this channel


Embed this content in your HTML

Search

Report adult content:

click to rate:

Account: (login)

More Channels


Channel Catalog


older | 1 | .... | 3044 | 3045 | (Page 3046) | 3047 | 3048 | .... | 3119 | newer

    0 0

    Reporter Stefan Sidlo (ssdcops) Stefan Sidlo (ssdcops)
    Created Sep 3, 2018 2:45:12 PM
    Updated Nov 8, 2018 3:25:58 PM
    Resolved Oct 18, 2018 6:30:00 PM
    State Verified
    Assignee Leonid Stryuk (Leonid.Stryuk)
    Subsystem Single Issue View
    Type Task
    Priority Normal
    Fix versions 2018.3.47010

    Hey,

    We are currently running 2018.1 and we are quite enjoying the <Generate issue template URL> on already existing Tasks.

    We want to update out YouTrack to the newest version but after testing it on a test system, the <Generate issue template URL> is gone.

    KR,
    Stefan Sidlo


    0 0

    Reporter Anna Zhdan (Anna.Zhdan) Anna Zhdan (Anna.Zhdan)
    Created Oct 1, 2018 12:11:48 PM
    Updated Nov 8, 2018 3:25:58 PM
    Resolved Oct 22, 2018 6:00:00 PM
    State Verified
    Assignee Alexander Anisimov (xi-eye)
    Subsystem Issue List
    Type Bug
    Priority Normal
    Browser Any Browser
    OS Any OS
    Fix versions 2018.3.47010
    Affected versions Unknown

    0 0

    Reporter Dmitry Gizatov (mitya) Dmitry Gizatov (mitya)
    Created Oct 9, 2018 12:34:16 PM
    Updated Nov 8, 2018 3:25:58 PM
    Resolved Oct 30, 2018 3:55:21 PM
    State Fixed
    Assignee Ekaterina Zaikina (Ekaterina_Zaikina)
    Subsystem Issue Links
    Type Feature
    Priority Major
    Fix versions 2018.3.47010

    I'd like to suggest some links improvements.
    Overview:

    1. Links block

    • JT-50047)
    • JT-50049)
    • Discussable (extracted to JT-50049)
    1. "Duplicates" redesign (extracted to JT-50048)

    1. "Subtask of" redesign (extracted to JT-50048)



    0 0

    Reporter Roman Kolobov (rekolobov) Roman Kolobov (rekolobov)
    Created Oct 10, 2018 12:31:46 PM
    Updated Nov 8, 2018 3:25:58 PM
    Resolved Oct 17, 2018 3:12:32 PM
    State Verified
    Assignee Vyacheslav Lukianov (hoegaarden)
    Subsystem Full Text Index
    Type Task
    Priority Critical
    Fix versions 2018.3.47010

    2018.3.46370

    Searching for #jt test email on perftests backup throws an exception

    12:27:28,188 ERROR [@AsyncProcessor1] [ntityStoreSharedAsyncProcessor] [] -110
    ...

    12:27:28,188 ERROR [@AsyncProcessor1] [ntityStoreSharedAsyncProcessor] [] -110 java.lang.ArrayIndexOutOfBoundsException: -110 at org.apache.lucene.codecs.lucene50.ForUtil.readBlock(ForUtil.java:196) ~[lucene-core-7.5.0.jar:7.5.0 b5bf70b7e32d7ddd9742cc821d471c5fabd4e3df - jimczi - 2018-09-18 13:01:13] at org.apache.lucene.codecs.lucene50.Lucene50PostingsReader$BlockDocsEnum.refillDocs(Lucene50PostingsReader.java:357) ~[lucene-core-7.5.0.jar:7.5.0 b5bf70b7e32d7ddd9742cc821d471c5fabd4e3df - jimczi - 2018-09-18 13:01:13] at org.apache.lucene.codecs.lucene50.Lucene50PostingsReader$BlockDocsEnum.advance(Lucene50PostingsReader.java:441) ~[lucene-core-7.5.0.jar:7.5.0 b5bf70b7e32d7ddd9742cc821d471c5fabd4e3df - jimczi - 2018-09-18 13:01:13] at org.apache.lucene.search.ConjunctionDISI.doNext(ConjunctionDISI.java:200) ~[lucene-core-7.5.0.jar:7.5.0 b5bf70b7e32d7ddd9742cc821d471c5fabd4e3df - jimczi - 2018-09-18 13:01:13] at org.apache.lucene.search.ConjunctionDISI.nextDoc(ConjunctionDISI.java:240) ~[lucene-core-7.5.0.jar:7.5.0 b5bf70b7e32d7ddd9742cc821d471c5fabd4e3df - jimczi - 2018-09-18 13:01:13] at org.apache.lucene.search.Weight$DefaultBulkScorer.scoreAll(Weight.java:261) ~[lucene-core-7.5.0.jar:7.5.0 b5bf70b7e32d7ddd9742cc821d471c5fabd4e3df - jimczi - 2018-09-18 13:01:13] at org.apache.lucene.search.Weight$DefaultBulkScorer.score(Weight.java:214) ~[lucene-core-7.5.0.jar:7.5.0 b5bf70b7e32d7ddd9742cc821d471c5fabd4e3df - jimczi - 2018-09-18 13:01:13] at org.apache.lucene.search.BulkScorer.score(BulkScorer.java:39) ~[lucene-core-7.5.0.jar:7.5.0 b5bf70b7e32d7ddd9742cc821d471c5fabd4e3df - jimczi - 2018-09-18 13:01:13] at org.apache.lucene.search.IndexSearcher.search(IndexSearcher.java:670) ~[lucene-core-7.5.0.jar:7.5.0 b5bf70b7e32d7ddd9742cc821d471c5fabd4e3df - jimczi - 2018-09-18 13:01:13] at org.apache.lucene.search.IndexSearcher.search(IndexSearcher.java:471) ~[lucene-core-7.5.0.jar:7.5.0 b5bf70b7e32d7ddd9742cc821d471c5fabd4e3df - jimczi - 2018-09-18 13:01:13] at org.apache.lucene.search.IndexSearcher.search(IndexSearcher.java:592) ~[lucene-core-7.5.0.jar:7.5.0 b5bf70b7e32d7ddd9742cc821d471c5fabd4e3df - jimczi - 2018-09-18 13:01:13] at org.apache.lucene.search.IndexSearcher.searchAfter(IndexSearcher.java:447) ~[lucene-core-7.5.0.jar:7.5.0 b5bf70b7e32d7ddd9742cc821d471c5fabd4e3df - jimczi - 2018-09-18 13:01:13] at org.apache.lucene.search.IndexSearcher.search(IndexSearcher.java:458) ~[lucene-core-7.5.0.jar:7.5.0 b5bf70b7e32d7ddd9742cc821d471c5fabd4e3df - jimczi - 2018-09-18 13:01:13] at jetbrains.youtrack.textindex.impl.HitsEntityIterator.<init>(HitsEntityIterator.java:40) ~[youtrack-text-search-2018.3.jar:?] at jetbrains.youtrack.textindex.impl.SearchResultsEntityIterable.getIteratorImpl(SearchResultsEntityIterable.java:66) ~[youtrack-text-search-2018.3.jar:?] at jetbrains.exodus.entitystore.iterate.EntityIterableBase.iterator(EntityIterableBase.java:138) ~[xodus-entity-store-1.2.3471.jar:1.2.3471] at jetbrains.exodus.entitystore.iterate.binop.IntersectionIterable$UnsortedIterator.<init>(IntersectionIterable.java:183) ~[xodus-entity-store-1.2.3471.jar:1.2.3471] at jetbrains.exodus.entitystore.iterate.binop.IntersectionIterable$UnsortedIterator.<init>(IntersectionIterable.java:166) ~[xodus-entity-store-1.2.3471.jar:1.2.3471] at jetbrains.exodus.entitystore.iterate.binop.IntersectionIterable.getIteratorImpl(IntersectionIterable.java:79) ~[xodus-entity-store-1.2.3471.jar:1.2.3471] at jetbrains.exodus.entitystore.iterate.binop.IntersectionIterable.getIteratorImpl(IntersectionIterable.java:23) ~[xodus-entity-store-1.2.3471.jar:1.2.3471] at jetbrains.exodus.entitystore.iterate.EntityIterableBase.iterator(EntityIterableBase.java:138) ~[xodus-entity-store-1.2.3471.jar:1.2.3471] at jetbrains.exodus.entitystore.iterate.binop.MinusIterable$UnsortedIterator.<init>(MinusIterable.java:154) ~[xodus-entity-store-1.2.3471.jar:1.2.3471] at jetbrains.exodus.entitystore.iterate.binop.MinusIterable$UnsortedIterator.<init>(MinusIterable.java:138) ~[xodus-entity-store-1.2.3471.jar:1.2.3471] at jetbrains.exodus.entitystore.iterate.binop.MinusIterable.getIteratorImpl(MinusIterable.java:55) ~[xodus-entity-store-1.2.3471.jar:1.2.3471] at jetbrains.exodus.entitystore.iterate.binop.MinusIterable.getIteratorImpl(MinusIterable.java:23) ~[xodus-entity-store-1.2.3471.jar:1.2.3471] at jetbrains.exodus.entitystore.iterate.EntityIdArrayCachedInstanceIterableFactory.createInstance(EntityIdArrayCachedInstanceIterableFactory.java:36) ~[xodus-entity-store-1.2.3471.jar:1.2.3471] at jetbrains.exodus.entitystore.iterate.EntityIterableBase.createCachedInstance(EntityIterableBase.java:580) ~[xodus-entity-store-1.2.3471.jar:1.2.3471] at jetbrains.exodus.entitystore.iterate.EntityIterableBase.getOrCreateCachedInstance(EntityIterableBase.java:512) ~[xodus-entity-store-1.2.3471.jar:1.2.3471] at jetbrains.exodus.entitystore.EntityIterableCache$EntityIterableAsyncInstantiation$1.execute(EntityIterableCache.java:250) ~[xodus-entity-store-1.2.3471.jar:1.2.3471] at jetbrains.exodus.entitystore.PersistentEntityStoreImpl.executeInReadonlyTransaction(PersistentEntityStoreImpl.java:720) ~[xodus-entity-store-1.2.3471.jar:1.2.3471] at jetbrains.exodus.entitystore.EntityIterableCache$EntityIterableAsyncInstantiation.execute(EntityIterableCache.java:237) ~[xodus-entity-store-1.2.3471.jar:1.2.3471] at jetbrains.exodus.core.execution.Job.run(Job.java:99) [xodus-utils-1.2.3471.jar:1.2.3471] at jetbrains.exodus.core.execution.ThreadJobProcessor.executeJob(ThreadJobProcessor.java:133) [xodus-utils-1.2.3471.jar:1.2.3471] at jetbrains.exodus.core.execution.JobProcessorQueueAdapter.doExecuteJob(JobProcessorQueueAdapter.java:243) [xodus-utils-1.2.3471.jar:1.2.3471] at jetbrains.exodus.core.execution.JobProcessorQueueAdapter.doJobs(JobProcessorQueueAdapter.java:161) [xodus-utils-1.2.3471.jar:1.2.3471] at jetbrains.exodus.core.execution.ThreadJobProcessor.run(ThreadJobProcessor.java:111) [xodus-utils-1.2.3471.jar:1.2.3471] at jetbrains.exodus.core.execution.ThreadJobProcessor$1.run(ThreadJobProcessor.java:43) [xodus-utils-1.2.3471.jar:1.2.3471] at java.lang.Thread.run(Thread.java:748) [?:1.8.0_171] WARN ServletHandler - /issues/ java.lang.ArrayIndexOutOfBoundsException: -110 at org.apache.lucene.codecs.lucene50.ForUtil.readBlock(ForUtil.java:196) at org.apache.lucene.codecs.lucene50.Lucene50PostingsReader$BlockDocsEnum.refillDocs(Lucene50PostingsReader.java:357) at org.apache.lucene.codecs.lucene50.Lucene50PostingsReader$BlockDocsEnum.advance(Lucene50PostingsReader.java:441) at org.apache.lucene.search.ConjunctionDISI.doNext(ConjunctionDISI.java:200) at org.apache.lucene.search.ConjunctionDISI.nextDoc(ConjunctionDISI.java:240) at org.apache.lucene.search.Weight$DefaultBulkScorer.scoreAll(Weight.java:261) at org.apache.lucene.search.Weight$DefaultBulkScorer.score(Weight.java:214) at org.apache.lucene.search.BulkScorer.score(BulkScorer.java:39) at org.apache.lucene.search.IndexSearcher.search(IndexSearcher.java:670) at org.apache.lucene.search.IndexSearcher.search(IndexSearcher.java:471) at org.apache.lucene.search.IndexSearcher.search(IndexSearcher.java:592) at org.apache.lucene.search.IndexSearcher.searchAfter(IndexSearcher.java:447) at org.apache.lucene.search.IndexSearcher.search(IndexSearcher.java:458) at jetbrains.youtrack.textindex.impl.HitsEntityIterator.<init>(HitsEntityIterator.java:40) at jetbrains.youtrack.textindex.impl.SearchResultsEntityIterable.getIteratorImpl(SearchResultsEntityIterable.java:66) at jetbrains.exodus.entitystore.iterate.EntityIterableBase.iterator(EntityIterableBase.java:138) at jetbrains.exodus.entitystore.iterate.binop.IntersectionIterable$UnsortedIterator.<init>(IntersectionIterable.java:183) at jetbrains.exodus.entitystore.iterate.binop.IntersectionIterable$UnsortedIterator.<init>(IntersectionIterable.java:166) at jetbrains.exodus.entitystore.iterate.binop.IntersectionIterable.getIteratorImpl(IntersectionIterable.java:79) at jetbrains.exodus.entitystore.iterate.binop.IntersectionIterable.getIteratorImpl(IntersectionIterable.java:23) at jetbrains.exodus.entitystore.iterate.EntityIterableBase.iterator(EntityIterableBase.java:138) at jetbrains.exodus.entitystore.iterate.binop.MinusIterable$UnsortedIterator.<init>(MinusIterable.java:154) at jetbrains.exodus.entitystore.iterate.binop.MinusIterable$UnsortedIterator.<init>(MinusIterable.java:138) at jetbrains.exodus.entitystore.iterate.binop.MinusIterable.getIteratorImpl(MinusIterable.java:55) at jetbrains.exodus.entitystore.iterate.binop.MinusIterable.getIteratorImpl(MinusIterable.java:23) at jetbrains.exodus.entitystore.iterate.EntityIdArrayCachedInstanceIterableFactory.createInstance(EntityIdArrayCachedInstanceIterableFactory.java:36) at jetbrains.exodus.entitystore.iterate.EntityIterableBase.createCachedInstance(EntityIterableBase.java:580) at jetbrains.exodus.entitystore.iterate.EntityIterableBase.getOrCreateCachedInstance(EntityIterableBase.java:512) at jetbrains.exodus.entitystore.iterate.EntityIterableBase.getOrCreateCachedInstance(EntityIterableBase.java:497) at jetbrains.exodus.entitystore.iterate.EntityIterableBase.toSet(EntityIterableBase.java:529) at jetbrains.exodus.entitystore.iterate.SortIterable$NonStableSortIterator.<init>(SortIterable.java:340) at jetbrains.exodus.entitystore.iterate.SortIterable$NonStableSortIterator.<init>(SortIterable.java:326) at jetbrains.exodus.entitystore.iterate.SortIterable.getIteratorImpl(SortIterable.java:159) at jetbrains.exodus.entitystore.iterate.SortResultIterable.getIteratorImpl(SortResultIterable.java:97) at jetbrains.exodus.entitystore.iterate.EntityIterableBase.iterator(EntityIterableBase.java:138) at com.jetbrains.teamsys.dnq.database.PersistentEntityIterableWrapper.iterator(PersistentEntityIterableWrapper.kt:125) at com.jetbrains.teamsys.dnq.database.PersistentEntityIterableWrapper.iterator(PersistentEntityIterableWrapper.kt:32) at jetbrains.mps.internal.collections.runtime.impl.BasicSequence.iterator(BasicSequence.java:19) at jetbrains.mps.internal.collections.runtime.impl.FilteringSequence$FilteringIterator.init(FilteringSequence.java:60) at jetbrains.mps.internal.collections.runtime.impl.FilteringSequence$FilteringIterator.hasNext(FilteringSequence.java:34) at jetbrains.mps.internal.collections.runtime.impl.PagingSequence$PagingIterator.takeNext(PagingSequence.java:174) at jetbrains.mps.internal.collections.runtime.impl.PagingSequence$PagingIterator.moveToNext(PagingSequence.java:122) at jetbrains.mps.internal.collections.runtime.impl.PagingSequence$PagingIterator.hasNext(PagingSequence.java:56) at jetbrains.mps.internal.collections.runtime.ListSequence.fromIterable(ListSequence.java:313) at jetbrains.mps.internal.collections.runtime.Sequence.toListSequence(Sequence.java:220) at jetbrains.charisma.smartui.dto.IssuesDTO.<init>(IssuesDTO.java:86) at jetbrains.charisma.smartui.workspace.Issues_RootHtmlTemplateComponent$12.invoke(Issues_RootHtmlTemplateComponent.java:258) at jetbrains.charisma.smartui.workspace.Issues_RootHtmlTemplateComponent$12.invoke(Issues_RootHtmlTemplateComponent.java:254) at jetbrains.charisma.smartui.pager.PagerInfo.update(PagerInfo.java:205) at jetbrains.charisma.smartui.workspace.Issues_RootHtmlTemplateComponent.onEnter(Issues_RootHtmlTemplateComponent.java:270) at jetbrains.mps.webr.runtime.templateComponent.TemplateComponent.<init>(TemplateComponent.java:96) at jetbrains.charisma.smartui.workspace.Issues_RootHtmlTemplateComponent.<init>(Issues_RootHtmlTemplateComponent.java:121) at jetbrains.charisma.smartui.workspace.Issues_RootHtmlTemplateController$Action.createTemplateComponent(Issues_RootHtmlTemplateController.java:55) at jetbrains.mps.webr.runtime.templateComponent.TemplateActionController.getRootTemplateRenderResponseAction(TemplateActionController.java:92) at jetbrains.mps.webr.runtime.templateComponent.TemplateActionController.doEnterAction(TemplateActionController.java:60) at jetbrains.mps.webr.runtime.templateComponent.ActionController.securedRefreshResponse(ActionController.java:158) at jetbrains.mps.webr.runtime.templateComponent.ActionController.enterAction(ActionController.java:83) at jetbrains.mps.webr.runtime.requestProcessor.ActionControllerUtil.doEnterAction(ActionControllerUtil.java:17) at jetbrains.mps.webr.runtime.requestProcessor.ActionControllerUtil.processRequest(ActionControllerUtil.java:60) at jetbrains.mps.webr.runtime.requestProcessor.HtmlTemplateRequestProcessor.processRequest(HtmlTemplateRequestProcessor.java:42) at jetbrains.mps.webr.runtime.servlet.MainServlet.processRequest(MainServlet.java:225) at jetbrains.mps.webr.runtime.servlet.MainServlet.doGet(MainServlet.java:141) at javax.servlet.http.HttpServlet.service(HttpServlet.java:687) at javax.servlet.http.HttpServlet.service(HttpServlet.java:790) at org.eclipse.jetty.servlet.ServletHolder.handle(ServletHolder.java:848) at org.eclipse.jetty.servlet.ServletHandler$CachedChain.doFilter(ServletHandler.java:1772) at jetbrains.youtrack.webapp.filters.RootGoFilter.doFilter(RootGoFilter.kt:53) at jetbrains.youtrack.webapp.filters.FilterAdapter.doFilter(FilterAdapter.kt:25) at org.eclipse.jetty.servlet.ServletHandler$CachedChain.doFilter(ServletHandler.java:1759) at jetbrains.youtrack.webapp.filters.NewUIFilter.doFilter(NewUIFilter.kt:58) at jetbrains.youtrack.webapp.filters.FilterAdapter.doFilter(FilterAdapter.kt:25) at org.eclipse.jetty.servlet.ServletHandler$CachedChain.doFilter(ServletHandler.java:1759) at jetbrains.youtrack.webapp.filters.SetThreadLocalPrincipalFilter.doFilter(SetThreadLocalPrincipalFilter.kt:19) at jetbrains.youtrack.webapp.filters.FilterAdapter.doFilter(FilterAdapter.kt:25) at org.eclipse.jetty.servlet.ServletHandler$CachedChain.doFilter(ServletHandler.java:1759) at jetbrains.youtrack.webapp.filters.WebrSessionAuthenticationFilter.doFilter(WebrSessionAuthenticationFilter.kt:36) at jetbrains.youtrack.webapp.filters.FilterAdapter.doFilter(FilterAdapter.kt:25) at org.eclipse.jetty.servlet.ServletHandler$CachedChain.doFilter(ServletHandler.java:1759) at jetbrains.mps.webr.runtime.filter.QueryParameterFilter.doFilter(QueryParameterFilter.java:25) at org.eclipse.jetty.servlet.ServletHandler$CachedChain.doFilter(ServletHandler.java:1759) at org.eclipse.jetty.continuation.ContinuationFilter.doFilter(ContinuationFilter.java:127) at org.eclipse.jetty.servlet.ServletHandler$CachedChain.doFilter(ServletHandler.java:1759) at jetbrains.youtrack.webapp.filters.SecurityResponseHeadersFilter.doFilter(SecurityResponseHeadersFilter.kt:18) at jetbrains.youtrack.webapp.filters.FilterAdapter.doFilter(FilterAdapter.kt:25) at org.eclipse.jetty.servlet.ServletHandler$CachedChain.doFilter(ServletHandler.java:1759) at jetbrains.youtrack.webapp.filters.SearchEngineIndexBotAuthenticationFilter.doFilter(SearchEngineIndexBotAuthenticationFilter.kt:46) at jetbrains.youtrack.webapp.filters.FilterAdapter.doFilter(FilterAdapter.kt:25) at org.eclipse.jetty.servlet.ServletHandler$CachedChain.doFilter(ServletHandler.java:1759) at org.eclipse.jetty.servlet.ServletHandler.doHandle(ServletHandler.java:582) at org.eclipse.jetty.server.handler.ScopedHandler.handle(ScopedHandler.java:143) at org.eclipse.jetty.security.SecurityHandler.handle(SecurityHandler.java:548) at org.eclipse.jetty.server.session.SessionHandler.doHandle(SessionHandler.java:226) at org.eclipse.jetty.server.handler.ContextHandler.doHandle(ContextHandler.java:1180) at org.eclipse.jetty.servlet.ServletHandler.doScope(ServletHandler.java:512) at org.eclipse.jetty.server.session.SessionHandler.doScope(SessionHandler.java:185) at org.eclipse.jetty.server.handler.ContextHandler.doScope(ContextHandler.java:1112) at org.eclipse.jetty.server.handler.ScopedHandler.handle(ScopedHandler.java:141) at org.eclipse.jetty.server.handler.gzip.GzipHandler.handle(GzipHandler.java:493) at org.eclipse.jetty.server.handler.ContextHandlerCollection.handle(ContextHandlerCollection.java:213) at org.eclipse.jetty.server.handler.HandlerWrapper.handle(HandlerWrapper.java:134) at org.eclipse.jetty.server.Server.handle(Server.java:534) at jetbrains.youtrack.standalone.instrumentation.InstrumentingServer.handle(InstrumentingServer.java:40) at org.eclipse.jetty.server.HttpChannel.handle(HttpChannel.java:320) at org.eclipse.jetty.server.HttpConnection.onFillable(HttpConnection.java:251) at org.eclipse.jetty.io.AbstractConnection$ReadCallback.succeeded(AbstractConnection.java:283) at org.eclipse.jetty.io.FillInterest.fillable(FillInterest.java:108) at org.eclipse.jetty.io.SelectChannelEndPoint$2.run(SelectChannelEndPoint.java:93) at org.eclipse.jetty.util.thread.strategy.ExecuteProduceConsume.executeProduceConsume(ExecuteProduceConsume.java:303) at org.eclipse.jetty.util.thread.strategy.ExecuteProduceConsume.produceConsume(ExecuteProduceConsume.java:148) at org.eclipse.jetty.util.thread.strategy.ExecuteProduceConsume.run(ExecuteProduceConsume.java:136) at org.eclipse.jetty.util.thread.QueuedThreadPool.runJob(QueuedThreadPool.java:671) at org.eclipse.jetty.util.thread.QueuedThreadPool$2.run(QueuedThreadPool.java:589) at java.lang.Thread.run(Thread.java:748) 12:27:28,202 ERROR [@AsyncProcessor1] [ntityStoreSharedAsyncProcessor] [] -110 java.lang.ArrayIndexOutOfBoundsException: -110 at org.apache.lucene.codecs.lucene50.ForUtil.readBlock(ForUtil.java:196) ~[lucene-core-7.5.0.jar:7.5.0 b5bf70b7e32d7ddd9742cc821d471c5fabd4e3df - jimczi - 2018-09-18 13:01:13] at org.apache.lucene.codecs.lucene50.Lucene50PostingsReader$BlockDocsEnum.refillDocs(Lucene50PostingsReader.java:357) ~[lucene-core-7.5.0.jar:7.5.0 b5bf70b7e32d7ddd9742cc821d471c5fabd4e3df - jimczi - 2018-09-18 13:01:13] at org.apache.lucene.codecs.lucene50.Lucene50PostingsReader$BlockDocsEnum.advance(Lucene50PostingsReader.java:441) ~[lucene-core-7.5.0.jar:7.5.0 b5bf70b7e32d7ddd9742cc821d471c5fabd4e3df - jimczi - 2018-09-18 13:01:13] at org.apache.lucene.search.ConjunctionDISI.doNext(ConjunctionDISI.java:200) ~[lucene-core-7.5.0.jar:7.5.0 b5bf70b7e32d7ddd9742cc821d471c5fabd4e3df - jimczi - 2018-09-18 13:01:13] at org.apache.lucene.search.ConjunctionDISI.nextDoc(ConjunctionDISI.java:240) ~[lucene-core-7.5.0.jar:7.5.0 b5bf70b7e32d7ddd9742cc821d471c5fabd4e3df - jimczi - 2018-09-18 13:01:13] at org.apache.lucene.search.Weight$DefaultBulkScorer.scoreAll(Weight.java:261) ~[lucene-core-7.5.0.jar:7.5.0 b5bf70b7e32d7ddd9742cc821d471c5fabd4e3df - jimczi - 2018-09-18 13:01:13] at org.apache.lucene.search.Weight$DefaultBulkScorer.score(Weight.java:214) ~[lucene-core-7.5.0.jar:7.5.0 b5bf70b7e32d7ddd9742cc821d471c5fabd4e3df - jimczi - 2018-09-18 13:01:13] at org.apache.lucene.search.BulkScorer.score(BulkScorer.java:39) ~[lucene-core-7.5.0.jar:7.5.0 b5bf70b7e32d7ddd9742cc821d471c5fabd4e3df - jimczi - 2018-09-18 13:01:13] at org.apache.lucene.search.IndexSearcher.search(IndexSearcher.java:670) ~[lucene-core-7.5.0.jar:7.5.0 b5bf70b7e32d7ddd9742cc821d471c5fabd4e3df - jimczi - 2018-09-18 13:01:13] at org.apache.lucene.search.IndexSearcher.search(IndexSearcher.java:471) ~[lucene-core-7.5.0.jar:7.5.0 b5bf70b7e32d7ddd9742cc821d471c5fabd4e3df - jimczi - 2018-09-18 13:01:13] at org.apache.lucene.search.IndexSearcher.search(IndexSearcher.java:592) ~[lucene-core-7.5.0.jar:7.5.0 b5bf70b7e32d7ddd9742cc821d471c5fabd4e3df - jimczi - 2018-09-18 13:01:13] at org.apache.lucene.search.IndexSearcher.searchAfter(IndexSearcher.java:447) ~[lucene-core-7.5.0.jar:7.5.0 b5bf70b7e32d7ddd9742cc821d471c5fabd4e3df - jimczi - 2018-09-18 13:01:13] at org.apache.lucene.search.IndexSearcher.search(IndexSearcher.java:458) ~[lucene-core-7.5.0.jar:7.5.0 b5bf70b7e32d7ddd9742cc821d471c5fabd4e3df - jimczi - 2018-09-18 13:01:13] at jetbrains.youtrack.textindex.impl.HitsEntityIterator.<init>(HitsEntityIterator.java:40) ~[youtrack-text-search-2018.3.jar:?] at jetbrains.youtrack.textindex.impl.SearchResultsEntityIterable.getIteratorImpl(SearchResultsEntityIterable.java:66) ~[youtrack-text-search-2018.3.jar:?] at jetbrains.exodus.entitystore.iterate.EntityIterableBase.iterator(EntityIterableBase.java:138) ~[xodus-entity-store-1.2.3471.jar:1.2.3471] at jetbrains.exodus.entitystore.iterate.binop.IntersectionIterable$UnsortedIterator.<init>(IntersectionIterable.java:183) ~[xodus-entity-store-1.2.3471.jar:1.2.3471] at jetbrains.exodus.entitystore.iterate.binop.IntersectionIterable$UnsortedIterator.<init>(IntersectionIterable.java:166) ~[xodus-entity-store-1.2.3471.jar:1.2.3471] at jetbrains.exodus.entitystore.iterate.binop.IntersectionIterable.getIteratorImpl(IntersectionIterable.java:79) ~[xodus-entity-store-1.2.3471.jar:1.2.3471] at jetbrains.exodus.entitystore.iterate.binop.IntersectionIterable.getIteratorImpl(IntersectionIterable.java:23) ~[xodus-entity-store-1.2.3471.jar:1.2.3471] at jetbrains.exodus.entitystore.iterate.EntityIterableBase.iterator(EntityIterableBase.java:138) ~[xodus-entity-store-1.2.3471.jar:1.2.3471] at jetbrains.exodus.entitystore.iterate.binop.MinusIterable$UnsortedIterator.<init>(MinusIterable.java:154) ~[xodus-entity-store-1.2.3471.jar:1.2.3471] at jetbrains.exodus.entitystore.iterate.binop.MinusIterable$UnsortedIterator.<init>(MinusIterable.java:138) ~[xodus-entity-store-1.2.3471.jar:1.2.3471] at jetbrains.exodus.entitystore.iterate.binop.MinusIterable.getIteratorImpl(MinusIterable.java:55) ~[xodus-entity-store-1.2.3471.jar:1.2.3471] at jetbrains.exodus.entitystore.iterate.binop.MinusIterable.getIteratorImpl(MinusIterable.java:23) ~[xodus-entity-store-1.2.3471.jar:1.2.3471] at jetbrains.exodus.entitystore.iterate.EntityIdArrayCachedInstanceIterableFactory.createInstance(EntityIdArrayCachedInstanceIterableFactory.java:36) ~[xodus-entity-store-1.2.3471.jar:1.2.3471] at jetbrains.exodus.entitystore.iterate.EntityIterableBase.createCachedInstance(EntityIterableBase.java:580) ~[xodus-entity-store-1.2.3471.jar:1.2.3471] at jetbrains.exodus.entitystore.iterate.EntityIterableBase.getOrCreateCachedInstance(EntityIterableBase.java:512) ~[xodus-entity-store-1.2.3471.jar:1.2.3471] at jetbrains.exodus.entitystore.EntityIterableCache$EntityIterableAsyncInstantiation$1.execute(EntityIterableCache.java:250) ~[xodus-entity-store-1.2.3471.jar:1.2.3471] at jetbrains.exodus.entitystore.PersistentEntityStoreImpl.executeInReadonlyTransaction(PersistentEntityStoreImpl.java:720) ~[xodus-entity-store-1.2.3471.jar:1.2.3471] at jetbrains.exodus.entitystore.EntityIterableCache$EntityIterableAsyncInstantiation.execute(EntityIterableCache.java:237) ~[xodus-entity-store-1.2.3471.jar:1.2.3471] at jetbrains.exodus.core.execution.Job.run(Job.java:99) [xodus-utils-1.2.3471.jar:1.2.3471] at jetbrains.exodus.core.execution.ThreadJobProcessor.executeJob(ThreadJobProcessor.java:133) [xodus-utils-1.2.3471.jar:1.2.3471] at jetbrains.exodus.core.execution.JobProcessorQueueAdapter.doExecuteJob(JobProcessorQueueAdapter.java:243) [xodus-utils-1.2.3471.jar:1.2.3471] at jetbrains.exodus.core.execution.JobProcessorQueueAdapter.doJobs(JobProcessorQueueAdapter.java:161) [xodus-utils-1.2.3471.jar:1.2.3471] at jetbrains.exodus.core.execution.ThreadJobProcessor.run(ThreadJobProcessor.java:111) [xodus-utils-1.2.3471.jar:1.2.3471] at jetbrains.exodus.core.execution.ThreadJobProcessor$1.run(ThreadJobProcessor.java:43) [xodus-utils-1.2.3471.jar:1.2.3471] at java.lang.Thread.run(Thread.java:748) [?:1.8.0_171]


    0 0

    Reporter Oleg Larshin (Oleg.Larshin) Oleg Larshin (Oleg.Larshin)
    Created Oct 22, 2018 1:00:07 PM
    Updated Nov 8, 2018 3:25:58 PM
    Resolved Oct 22, 2018 7:15:01 PM
    State Fixed
    Assignee Alexander Volfman (Alexander.Volfman)
    Subsystem Workflow
    Type Bug
    Priority Normal
    Browser Any Browser
    OS Any OS
    Fix versions 2018.3.47010
    Affected versions 2018.3
    1. Export old workflow
    2. Send the exported archive to converter
    3. Getting the "Workflow zip does not contain one of required files." error.

    0 0

    Reporter Evgeny Naumenko (jk) Evgeny Naumenko (jk)
    Created Oct 26, 2018 8:01:21 PM
    Updated Nov 8, 2018 3:25:58 PM
    Resolved Oct 29, 2018 5:47:52 PM
    State Fixed
    Assignee Andrey Klyuev (Andrey.Klyuev)
    Subsystem Notifications
    Type Bug
    Priority Normal
    Browser Any Browser
    OS Any OS
    Fix versions 2018.3.47010
    Affected versions Unknown

    Given the stack trace it's highly likely to be a JRE issue:

    [2018-10-26 13:54:35,139] [YouTrack Error] Exception in thread "notificationsTaskExecutor-259" java.lang.NoSuchFieldError: state 
    ...

    [2018-10-26 13:54:35,139] [YouTrack Error] Exception in thread "notificationsTaskExecutor-259" java.lang.NoSuchFieldError: state [2018-10-26 13:54:35,139] [YouTrack Error] at sun.security.ssl.ClientHandshaker.processMessage(ClientHandshaker.java:198) [2018-10-26 13:54:35,139] [YouTrack Error] at sun.security.ssl.Handshaker.processLoop(Handshaker.java:1037) [2018-10-26 13:54:35,139] [YouTrack Error] at sun.security.ssl.Handshaker.process_record(Handshaker.java:965) [2018-10-26 13:54:35,139] [YouTrack Error] at sun.security.ssl.SSLSocketImpl.readRecord(SSLSocketImpl.java:1064) [2018-10-26 13:54:35,139] [YouTrack Error] at sun.security.ssl.SSLSocketImpl.performInitialHandshake(SSLSocketImpl.java:1367) [2018-10-26 13:54:35,139] [YouTrack Error] at sun.security.ssl.SSLSocketImpl.startHandshake(SSLSocketImpl.java:1395) [2018-10-26 13:54:35,139] [YouTrack Error] at sun.security.ssl.SSLSocketImpl.startHandshake(SSLSocketImpl.java:1379) [2018-10-26 13:54:35,139] [YouTrack Error] at com.sun.mail.util.SocketFetcher.configureSSLSocket(SocketFetcher.java:598) [2018-10-26 13:54:35,139] [YouTrack Error] at com.sun.mail.util.SocketFetcher.startTLS(SocketFetcher.java:525) [2018-10-26 13:54:35,139] [YouTrack Error] at com.sun.mail.smtp.SMTPTransport.startTLS(SMTPTransport.java:2059) [2018-10-26 13:54:35,139] [YouTrack Error] at com.sun.mail.smtp.SMTPTransport.protocolConnect(SMTPTransport.java:724) [2018-10-26 13:54:35,139] [YouTrack Error] at javax.mail.Service.connect(Service.java:366) [2018-10-26 13:54:35,139] [YouTrack Error] at org.springframework.mail.javamail.JavaMailSenderImpl.connectTransport(JavaMailSenderImpl.java:501) [2018-10-26 13:54:35,139] [YouTrack Error] at org.springframework.mail.javamail.JavaMailSenderImpl.doSend(JavaMailSenderImpl.java:421) [2018-10-26 13:54:35,139] [YouTrack Error] at org.springframework.mail.javamail.JavaMailSenderImpl.send(JavaMailSenderImpl.java:345) [2018-10-26 13:54:35,139] [YouTrack Error] at org.springframework.mail.javamail.JavaMailSenderImpl.send(JavaMailSenderImpl.java:340) [2018-10-26 13:54:35,139] [YouTrack Error] at jetbrains.charisma.notifications.mail.MailingServiceImpl$1.run(MailingServiceImpl.java:90) [2018-10-26 13:54:35,139] [YouTrack Error] at java.util.concurrent.ThreadPoolExecutor.runWorker(ThreadPoolExecutor.java:1149) [2018-10-26 13:54:35,139] [YouTrack Error] at java.util.concurrent.ThreadPoolExecutor$Worker.run(ThreadPoolExecutor.java:624) [2018-10-26 13:54:35,139] [YouTrack Error] at java.lang.Thread.run(Thread.java:748)


    0 0

    Reporter Alexander Buturlinov (alexander.buturlinov) Alexander Buturlinov (alexander.buturlinov)
    Created Nov 1, 2018 7:01:04 PM
    Updated Nov 8, 2018 3:25:58 PM
    Resolved Nov 6, 2018 1:22:11 PM
    State Verified
    Assignee Andrey Skladchikov (Andrey.Skladchikov)
    Subsystem Dashboard & Widgets
    Type Bug
    Priority Major
    Browser Any Browser
    OS Any OS
    Fix versions 2018.3.47010
    Affected versions Unknown

    STR:

    1. Start YT with empty database
    2. Log in
    3. Open Dashboard page


    0 0

    Reporter Alexander Buturlinov (alexander.buturlinov) Alexander Buturlinov (alexander.buturlinov)
    Created Nov 1, 2018 7:29:09 PM
    Updated Nov 8, 2018 3:25:58 PM
    Resolved Nov 2, 2018 12:10:43 PM
    State Verified
    Assignee Evgeny Naumenko (jk)
    Subsystem No Subsystem
    Type Bug
    Priority Normal
    Browser Any Browser
    OS Any OS
    Fix versions 2018.3.47010
    Affected versions Unknown

    STR:

    1. Start YT with empty database
    2. Found a lot of exceptions in logs
    java.lang.NullPointerException: null
            at jetbrains.youtrack.search.keyword.PrefixTrees$6.invoke(PrefixTrees.java:138) ~[youtrack-search-2018.3.jar:?]
            at jetbrains.youtrack.search.keyword.PrefixTrees$6.invoke(PrefixTrees.java:136) ~[youtrack-search-2018.3.jar:?]
            at jetbrains.youtrack.search.keyword.PrefixTrees.writeWith(PrefixTrees.java:191) ~[youtrack-search-2018.3.jar:?]
            at jetbrains.youtrack.search.keyword.PrefixTrees.putPrefix(PrefixTrees.java:136) ~[youtrack-search-2018.3.jar:?]
            at jetbrains.charisma.parser.filter.PrefixTreeInstaller.add(PrefixTreeInstaller.kt:63) ~[youtrack-application-2018.3.jar:?]
            at jetbrains.charisma.parser.filter.PrefixTreeInstaller.add(PrefixTreeInstaller.kt:49) ~[youtrack-application-2018.3.jar:?]
            at jetbrains.charisma.customfields.complex.common.parser.LocalizableFieldValueInstaller.add(LocalizableFieldValueInstaller.kt:28) ~[charisma-customfields-2018.3.jar:?]
            at jetbrains.charisma.customfields.complex.common.parser.LocalizableFieldValueInstaller.add(LocalizableFieldValueInstaller.kt:11) ~[charisma-customfields-2018.3.jar:?]
            at jetbrains.charisma.parser.XdEntityKeywordInstaller.addedAsync(XdEntityKeywordInstaller.kt:17) ~[youtrack-application-2018.3.jar:?]
            at kotlinx.dnq.listener.EntityListenerWrapper.addedAsync(LegacyEventMultiplexerUtils.kt:59) ~[dnq-1.2.394.jar:?]
            at jetbrains.exodus.entitystore.EventsMultiplexer$handleChange$10.invoke(EventsMultiplexer.kt:220) ~[dnq-transient-store-1.2.394.jar:1.2.3501]
            at jetbrains.exodus.entitystore.EventsMultiplexer$handleChange$10.invoke(EventsMultiplexer.kt:29) ~[dnq-transient-store-1.2.394.jar:1.2.3501]
            at jetbrains.exodus.entitystore.EventsMultiplexer.visit(EventsMultiplexer.kt:230) [dnq-transient-store-1.2.394.jar:1.2.3501]
            at jetbrains.exodus.entitystore.EventsMultiplexer.visit$default(EventsMultiplexer.kt:226) [dnq-transient-store-1.2.394.jar:1.2.3501]
            at jetbrains.exodus.entitystore.EventsMultiplexer.handleChange(EventsMultiplexer.kt:220) [dnq-transient-store-1.2.394.jar:1.2.3501]
            at jetbrains.exodus.entitystore.EventsMultiplexer.handlePerEntityTypeChanges(EventsMultiplexer.kt:196) [dnq-transient-store-1.2.394.jar:1.2.3501]
            at jetbrains.exodus.entitystore.EventsMultiplexer.fire$dnq_transient_store(EventsMultiplexer.kt:74) [dnq-transient-store-1.2.394.jar:1.2.3501]
            at jetbrains.exodus.entitystore.EventsMultiplexerJob$execute$1.invoke(EventsMultiplexerInternal.kt:76) [dnq-transient-store-1.2.394.jar:1.2.3501]
            at jetbrains.exodus.entitystore.EventsMultiplexerJob$execute$1.invoke(EventsMultiplexerInternal.kt:65) [dnq-transient-store-1.2.394.jar:1.2.3501]
            at com.jetbrains.teamsys.dnq.database.TransientEntityStoreExt.transactional(TransientEntityStoreExt.kt:51) [dnq-transient-store-1.2.394.jar:?]
            at com.jetbrains.teamsys.dnq.database.TransientEntityStoreImpl.transactional(TransientEntityStoreImpl.kt:95) [dnq-transient-store-1.2.394.jar:?]
            at jetbrains.exodus.database.TransientEntityStore$DefaultImpls.transactional$default(TransientEntityStore.kt:84) [dnq-open-api-1.2.394.jar:?]
            at jetbrains.exodus.entitystore.EventsMultiplexerJob.execute(EventsMultiplexerInternal.kt:75) [dnq-transient-store-1.2.394.jar:1.2.3501]
            at jetbrains.exodus.core.execution.Job.run(Job.java:99) [xodus-utils-1.2.3501.jar:1.2.3501]
            at jetbrains.exodus.core.execution.ThreadJobProcessor.executeJob(ThreadJobProcessor.java:133) [xodus-utils-1.2.3501.jar:1.2.3501]
            at jetbrains.exodus.core.execution.JobProcessorQueueAdapter.doExecuteJob(JobProcessorQueueAdapter.java:243) [xodus-utils-1.2.3501.jar:1.2.3501]
            at jetbrains.exodus.core.execution.JobProcessorQueueAdapter.doJobs(JobProcessorQueueAdapter.java:161) [xodus-utils-1.2.3501.jar:1.2.3501]
            at jetbrains.exodus.core.execution.ThreadJobProcessor.run(ThreadJobProcessor.java:111) [xodus-utils-1.2.3501.jar:1.2.3501]
            at jetbrains.exodus.core.execution.ThreadJobProcessor$1.run(ThreadJobProcessor.java:43) [xodus-utils-1.2.3501.jar:1.2.3501]
            at java.lang.Thread.run(Thread.java:748) [?:1.8.0_151]
    19:09:34,511 ERROR [@xerJobProcessor] [EventsMultiplexer             ] [] Exception while notifying entity listener.
    java.lang.NullPointerException: null
            at jetbrains.youtrack.search.keyword.PrefixTrees$6.invoke(PrefixTrees.java:138) ~[youtrack-search-2018.3.jar:?]
            at jetbrains.youtrack.search.keyword.PrefixTrees$6.invoke(PrefixTrees.java:136) ~[youtrack-search-2018.3.jar:?]
            at jetbrains.youtrack.search.keyword.PrefixTrees.writeWith(PrefixTrees.java:191) ~[youtrack-search-2018.3.jar:?]
            at jetbrains.youtrack.search.keyword.PrefixTrees.putPrefix(PrefixTrees.java:136) ~[youtrack-search-2018.3.jar:?]
            at jetbrains.charisma.parser.filter.PrefixTreeInstaller.add(PrefixTreeInstaller.kt:63) ~[youtrack-application-2018.3.jar:?]
            at jetbrains.charisma.parser.filter.PrefixTreeInstaller.add(PrefixTreeInstaller.kt:49) ~[youtrack-application-2018.3.jar:?]
            at jetbrains.charisma.customfields.complex.common.parser.LocalizableFieldValueInstaller.add(LocalizableFieldValueInstaller.kt:28) ~[charisma-customfields-2018.3.jar:?]
            at jetbrains.charisma.customfields.complex.common.parser.LocalizableFieldValueInstaller.add(LocalizableFieldValueInstaller.kt:11) ~[charisma-customfields-2018.3.jar:?]
            at jetbrains.charisma.parser.XdEntityKeywordInstaller.addedAsync(XdEntityKeywordInstaller.kt:17) ~[youtrack-application-2018.3.jar:?]
            at kotlinx.dnq.listener.EntityListenerWrapper.addedAsync(LegacyEventMultiplexerUtils.kt:59) ~[dnq-1.2.394.jar:?]
            at jetbrains.exodus.entitystore.EventsMultiplexer$handleChange$10.invoke(EventsMultiplexer.kt:220) ~[dnq-transient-store-1.2.394.jar:1.2.3501]
            at jetbrains.exodus.entitystore.EventsMultiplexer$handleChange$10.invoke(EventsMultiplexer.kt:29) ~[dnq-transient-store-1.2.394.jar:1.2.3501]
            at jetbrains.exodus.entitystore.EventsMultiplexer.visit(EventsMultiplexer.kt:230) [dnq-transient-store-1.2.394.jar:1.2.3501]
            at jetbrains.exodus.entitystore.EventsMultiplexer.visit$default(EventsMultiplexer.kt:226) [dnq-transient-store-1.2.394.jar:1.2.3501]
            at jetbrains.exodus.entitystore.EventsMultiplexer.handleChange(EventsMultiplexer.kt:220) [dnq-transient-store-1.2.394.jar:1.2.3501]
            at jetbrains.exodus.entitystore.EventsMultiplexer.handlePerEntityTypeChanges(EventsMultiplexer.kt:196) [dnq-transient-store-1.2.394.jar:1.2.3501]
            at jetbrains.exodus.entitystore.EventsMultiplexer.fire$dnq_transient_store(EventsMultiplexer.kt:74) [dnq-transient-store-1.2.394.jar:1.2.3501]
            at jetbrains.exodus.entitystore.EventsMultiplexerJob$execute$1.invoke(EventsMultiplexerInternal.kt:76) [dnq-transient-store-1.2.394.jar:1.2.3501]
            at jetbrains.exodus.entitystore.EventsMultiplexerJob$execute$1.invoke(EventsMultiplexerInternal.kt:65) [dnq-transient-store-1.2.394.jar:1.2.3501]
            at com.jetbrains.teamsys.dnq.database.TransientEntityStoreExt.transactional(TransientEntityStoreExt.kt:51) [dnq-transient-store-1.2.394.jar:?]
            at com.jetbrains.teamsys.dnq.database.TransientEntityStoreImpl.transactional(TransientEntityStoreImpl.kt:95) [dnq-transient-store-1.2.394.jar:?]
            at jetbrains.exodus.database.TransientEntityStore$DefaultImpls.transactional$default(TransientEntityStore.kt:84) [dnq-open-api-1.2.394.jar:?]
            at jetbrains.exodus.entitystore.EventsMultiplexerJob.execute(EventsMultiplexerInternal.kt:75) [dnq-transient-store-1.2.394.jar:1.2.3501]
            at jetbrains.exodus.core.execution.Job.run(Job.java:99) [xodus-utils-1.2.3501.jar:1.2.3501]
            at jetbrains.exodus.core.execution.ThreadJobProcessor.executeJob(ThreadJobProcessor.java:133) [xodus-utils-1.2.3501.jar:1.2.3501]
            at jetbrains.exodus.core.execution.JobProcessorQueueAdapter.doExecuteJob(JobProcessorQueueAdapter.java:243) [xodus-utils-1.2.3501.jar:1.2.3501]
            at jetbrains.exodus.core.execution.JobProcessorQueueAdapter.doJobs(JobProcessorQueueAdapter.java:161) [xodus-utils-1.2.3501.jar:1.2.3501]
            at jetbrains.exodus.core.execution.ThreadJobProcessor.run(ThreadJobProcessor.java:111) [xodus-utils-1.2.3501.jar:1.2.3501]
            at jetbrains.exodus.core.execution.ThreadJobProcessor$1.run(ThreadJobProcessor.java:43) [xodus-utils-1.2.3501.jar:1.2.3501]
            at java.lang.Thread.run(Thread.java:748) [?:1.8.0_151]
    ...
    

    0 0

    Reporter Ekaterina Alekseeva (Ekaterina.Alekseeva) Ekaterina Alekseeva (Ekaterina.Alekseeva)
    Created Nov 2, 2018 3:49:05 PM
    Updated Nov 8, 2018 3:25:58 PM
    Resolved Nov 2, 2018 4:34:49 PM
    State Verified
    Assignee Maxim Erekhinskiy (maxim.erehinskiy)
    Subsystem Single Issue View
    Type Bug
    Priority Normal
    Browser Any Browser
    OS Any OS
    Fix versions 2018.3.47010
    Affected versions Unknown

    build 46917

    STR:

    1. Go to FSI
    2. Click "..." button in toolbar
    3. Click "Print issue"

    AR:
    Old print issue page is opened


    0 0

    Reporter Ekaterina Alekseeva (Ekaterina.Alekseeva) Ekaterina Alekseeva (Ekaterina.Alekseeva)
    Created Nov 2, 2018 3:52:49 PM
    Updated Nov 8, 2018 3:25:58 PM
    Resolved Nov 2, 2018 5:16:06 PM
    State Verified
    Assignee Maxim Erekhinskiy (maxim.erehinskiy)
    Subsystem Single Issue View
    Type Bug
    Priority Normal
    Browser Any Browser
    OS Any OS
    Fix versions 2018.3.47010
    Affected versions Unknown

    build 46917

    Second page is unnecessary because it's almost empty
    See attached pdf


    0 0

    Reporter Alexander Buturlinov (alexander.buturlinov) Alexander Buturlinov (alexander.buturlinov)
    Created Nov 2, 2018 7:12:53 PM
    Updated Nov 8, 2018 3:25:58 PM
    Resolved Nov 2, 2018 7:30:16 PM
    State Fixed
    Assignee Alexey Volkov (Alexey.Volkov)
    Subsystem No Subsystem
    Type Bug
    Priority Normal
    Browser Any Browser
    OS Any OS
    Fix versions 2018.3.47010
    Affected versions Unknown

    STR:

    1. Call /rest/admin/customfield/field/Priority

    ER: Attribute type has value enum[1]
    AR: Attribute type has value jetbrains.charisma.customfields.complex.enumeration.SingleEnumFieldType


    0 0

    Reporter Mikhail Kapusta (Mikhail.Kapusta) Mikhail Kapusta (Mikhail.Kapusta)
    Created Jul 18, 2018 3:37:08 PM
    Updated Nov 8, 2018 3:28:28 PM
    Resolved Oct 18, 2018 3:54:30 PM
    State Verified
    Assignee Leonid Stryuk (Leonid.Stryuk)
    Subsystem Single Issue View
    Type Cosmetics
    Priority Normal
    Browser Any Browser
    OS Any OS
    Fix versions 2018.3.47010
    Affected versions Unknown

    Build 43602


    0 0

    Reporter Mikhail Kapusta (Mikhail.Kapusta) Mikhail Kapusta (Mikhail.Kapusta)
    Created Sep 11, 2018 3:09:43 PM
    Updated Nov 8, 2018 3:28:28 PM
    Resolved Oct 15, 2018 8:06:36 PM
    State Verified
    Assignee Ekaterina Zaikina (Ekaterina_Zaikina)
    Subsystem Single Issue View
    Type Bug
    Priority Normal
    Browser Any Browser
    OS Any OS
    Fix versions 2018.3.47010
    Affected versions Unknown

    Build 45501

    1. Open FSI, click "+Link issue"
    2. Select several issue with hotkeys
    3. press several times tab to move focus on Link issue button
      AR: fail

    0 0

    Reporter Дмитрий Хлопин (dmitriykhlopin) Дмитрий Хлопин (dmitriykhlopin)
    Created Oct 4, 2018 12:52:51 PM
    Updated Nov 8, 2018 3:28:28 PM
    Resolved Oct 22, 2018 7:41:33 PM
    State Fixed
    Assignee Max Maximov (Maxim.Maximov)
    Subsystem Projects
    Type Bug
    Priority Minor
    Browser Any Browser
    OS Any OS
    Fix versions 2018.3.47010
    Affected versions 2018.2.45513

    What steps will reproduce the problem?

    1. Open any project.
    2. Add user or group to team.

    What is the expected result?
    I expect the number of team members to change.

    What happens instead?
    Number of team members changes only after page refresh.

    Video in attachement.


    0 0

    Reporter Michael Peuß (mpeuss) Michael Peuß (mpeuss)
    Created Oct 11, 2018 12:33:06 PM
    Updated Nov 8, 2018 3:28:28 PM
    Resolved Oct 12, 2018 12:56:21 PM
    State Fixed
    Assignee Evgeny Naumenko (jk)
    Subsystem Integrations
    Type Bug
    Priority Major
    Browser Any Browser
    OS Any OS
    Fix versions 2018.3.47010
    Affected versions 2018.3.46358
    What steps will reproduce the problem?
    1. we have a Jenkins build server that has an SSL certificate signed by our own CA, both certificates are added to the "Trusted SSL Certificates"
    2. add this Jenkins server under "Build Server Integration Settings"
    3. click "Test connection"

    What is the expected result?
    connection should be ok

    What happens instead?
    An error occours:
    Connection test failed: sun.security.validator.ValidatorException: PKIX path building failed: sun.security.provider.certpath.SunCertPathBuilderException: unable to find valid certification path to requested target

    0 0

    Reporter Mikhail Kapusta (Mikhail.Kapusta) Mikhail Kapusta (Mikhail.Kapusta)
    Created Oct 11, 2018 3:37:56 PM
    Updated Nov 8, 2018 3:28:28 PM
    Resolved Oct 15, 2018 8:06:45 PM
    State Verified
    Assignee Ekaterina Zaikina (Ekaterina_Zaikina)
    Subsystem Single Issue View
    Type Bug
    Priority Normal
    Browser Any Browser
    OS Any OS
    Fix versions 2018.3.47010
    Affected versions Unknown

    Build 46404

    1. Goto issues
    2. Press several times "Ctrl+Shift+Alt+L"
      AR: several "links dialog" will be open

    0 0

    Reporter Roman Kolobov (rekolobov) Roman Kolobov (rekolobov)
    Created Oct 17, 2018 3:13:04 PM
    Updated Nov 8, 2018 3:28:28 PM
    Resolved Oct 19, 2018 10:39:42 AM
    State Verified
    Assignee Vyacheslav Lukianov (hoegaarden)
    Subsystem Full Text Index
    Type Performance Problem
    Priority Normal
    Browser Any Browser
    OS Any OS
    Fix versions 2018.3.47010
    Affected versions Unknown

    2018.3.46529

    Index had become larger by 30-40% (150+50Mb for performance DB, 5.6+1.3G for prod)
    Rebuild times have also increased (2m17s+32s for performance DB)

    An optimization would be very welcome


    0 0

    Reporter Дмитрий Хлопин (dmitriykhlopin) Дмитрий Хлопин (dmitriykhlopin)
    Created Oct 18, 2018 8:17:20 AM
    Updated Nov 8, 2018 3:28:28 PM
    Resolved Oct 18, 2018 12:30:00 PM
    State Verified
    Assignee Maksim Ryzhikov (maksimrv)
    Subsystem Single Issue View
    Type Bug
    Priority Normal
    Browser Any Browser
    OS Any OS
    Fix versions 2018.3.47010
    Affected versions 2018.3.46358

    What steps will reproduce the problem?

    1. Create issue
    2. Click on enum field
    3. Click on comment field and start typing

    What is the expected result?
    I expect to see text in comment

    What happens instead?
    Text appears in filter of custom field

    Video in attachment.


    0 0

    Reporter Maksim Ryzhikov (maksimrv) Maksim Ryzhikov (maksimrv)
    Created Oct 20, 2018 4:59:21 PM
    Updated Nov 8, 2018 3:28:28 PM
    Resolved Oct 22, 2018 2:45:00 PM
    State Fixed
    Assignee Maksim Ryzhikov (maksimrv)
    Subsystem Issue Creation
    Type Bug
    Priority Normal
    Browser Any Browser
    OS Any OS
    Fix versions 2018.3.47010
    Affected versions Unknown

    STR:

    • Press on [Create Issue]
    • Select project [Business Trip]
    • Click on custom field [Destination]
    • Select value [Conference]
    • Command dialog should be opened after previous step so press [Cancel] in command dialog

    ER: Command dialog is closed
    AR: Command dialog is open

    JT-48717


    0 0

    Reporter Anna Zhdan (Anna.Zhdan) Anna Zhdan (Anna.Zhdan)
    Created Oct 23, 2018 11:10:55 AM
    Updated Nov 8, 2018 3:28:28 PM
    Resolved Oct 23, 2018 7:20:37 PM
    State Fixed
    Assignee Daria Vasina (daria.vasina)
    Subsystem No Subsystem
    Type Bug
    Priority Normal
    Browser Any Browser
    OS Any OS
    Fix versions 2018.3.47010
    Affected versions Unknown

    Allow cards to be assigned to multiple sprints


older | 1 | .... | 3044 | 3045 | (Page 3046) | 3047 | 3048 | .... | 3119 | newer